{"text_format":"1","workbook":"xlsx","n_sheets":6,"sheets":["使い方","入力シート","チェックシート","チェックシート (連日用)","団体用P1","団体用P2"],"not_rendered":{"charts":0,"images":0,"macros":1,"external_links":0,"defined_names":4,"comments":0,"pivot_tables":0},"unopened":[],"bounds":{"document_bytes":16777216,"sheet_cells":100000,"rows_first":2000,"rows_last":500,"rows_between":2000,"halvings":0,"cell_chars":16384,"cell_head_chars":4096},"cells_cut":0,"cells_raw":0,"read":"whole","date_system":"1900"}

{"sheet":"使い方","index":0,"n_rows":18,"n_cols":11,"rows_kept":18,"cut":false,"hidden":false,"merged":[[0,0,0,18],[17,0,19,18],[1,0,2,18],[10,0,11,8],[10,10,11,18],[6,0,7,18],[3,0,3,18],[14,0,15,8]]}
["健康チェックシート　使用方法"]
["\n※マクロが登録されているので、シート名を変更すると正しく動作しません。\n※指導者・生徒・チーム関係者など同じ所属であれば全員出力できます。（最大50名まで）"]
[]
["入力シートに必要事項を入力する"]
[]
[]
["シート名『チェックシート』で入力を結果を確認し、\n【一括印刷】ボタンより印刷"]
[]
[]
[]
["連日で試合がある",null,null,null,null,null,null,null,null,null,"週をまたいで試合がある"]
[]
[]
[]
["シート名『チェックシート(連日用)』を【一括印刷】ボタンより印刷"]
{"$rows_left_out":4}
{"sheet":"入力シート","index":1,"n_rows":52,"n_cols":30,"rows_kept":52,"cut":false,"hidden":false,"merged":[]}
["No.","所属（学校名・会社名等）","区分","区分（その他）","氏名","フリガナ","郵便番号","住所","生年月日","年齢","性別","電話番号","アドレス",{"$f":"O1-1","v":"2021-05-14"},"2021-05-15","2021-05-16","2021-05-17","2021-05-18","2021-05-19","2021-05-20","2021-05-21","2021-05-22","2021-05-23","2021-05-24","2021-05-25","2021-05-26","2021-05-27","2021-05-28","2021-05-29","←ここの日付を大会当日にしてください"]
["例","群馬県立○✕高等学校","生徒","『その他』を選択した場合のみ記入して下さい。","群馬　太郎","グンマ　タロウ","370-0000","群馬県前橋市〇〇町１丁目２番地","2005-04-02",{"$f":"IF(I2=\"\",\"\",DATEDIF(I2,44357,\"Y\"))","v":16},"男性","090-0000-0000",null,36.299999999999997,36.6,36.700000000000003,36.200000000000003,36.799999999999997,36,36,36,36,36,36,36,36,36,36]
[{"$f":"IF(B3=\"\",\"\",COUNTIF($B$3:B3,$B$3))","v":1},"群馬県立群馬高等学校","指導者",null,"竹内 康伸","タケウチ ヤスノブ","436-0114","静岡県掛川市高田9-11-5","1980-04-19",{"$f":"IF(I3=\"\",\"\",DATEDIF(I3,TODAY(),\"Y\"))","v":41},"男性","070-7212-7897 "]
[{"$f":"IF(B4=\"\",\"\",COUNTIF($B$3:B4,$B$3))","v":2},"群馬県立群馬高等学校","指導者",null,"伊藤 茂信","イトウ シゲノブ","963-4601","福島県田村市常葉町山根8-9-3","1992-07-26",{"$f":"IF(I4=\"\",\"\",DATEDIF(I4,TODAY(),\"Y\"))","v":28},"男性","070-1697-4346 "]
[{"$f":"IF(B5=\"\",\"\",COUNTIF($B$3:B5,$B$3))","v":3},"群馬県立群馬高等学校","その他","帯同審判","安藤 幹也","アンドウ ミキヤ","982-0843","宮城県仙台市太白区茂ヶ崎3-10-6","1995-05-13",26,"男性","090-7857-1505 "]
[{"$f":"IF(B6=\"\",\"\",COUNTIF($B$3:B6,$B$3))","v":4},"群馬県立群馬高等学校","その他","トレーナー","白石 次男","シライシ ツグオ","112-0002","東京都文京区小石川5-1-1","1982-05-20",39,"男性","090-5237-3080 "]
[{"$f":"IF(B7=\"\",\"\",COUNTIF($B$3:B7,$B$3))","v":5},"群馬県立群馬高等学校","生徒",null,"金城 荘介","キンジョウ ソウスケ","321-0169","栃木県宇都宮市八千代4177","2003-04-29",18,"男性","090-3233-6517 "]
[{"$f":"IF(B8=\"\",\"\",COUNTIF($B$3:B8,$B$3))","v":""},null,null,null,null,null,null,null,null,""]
[{"$f":"IF(B9=\"\",\"\",COUNTIF($B$3:B9,$B$3))","v":""},null,null,null,null,null,null,null,null,""]
[{"$f":"IF(B10=\"\",\"\",COUNTIF($B$3:B10,$B$3))","v":""},null,null,null,null,null,null,null,null,""]
[{"$f":"IF(B11=\"\",\"\",COUNTIF($B$3:B11,$B$3))","v":""},null,null,null,null,null,null,null,null,""]
[{"$f":"IF(B12=\"\",\"\",COUNTIF($B$3:B12,$B$3))","v":""},null,null,null,null,null,null,null,null,""]
[{"$f":"IF(B13=\"\",\"\",COUNTIF($B$3:B13,$B$3))","v":""},null,null,null,null,null,null,null,null,""]
[{"$f":"IF(B14=\"\",\"\",COUNTIF($B$3:B14,$B$3))","v":""},null,null,null,null,null,null,null,null,""]
[{"$f":"IF(B15=\"\",\"\",COUNTIF($B$3:B15,$B$3))","v":""},null,null,null,null,null,null,null,null,""]
{"$rows_left_out":38}
{"sheet":"チェックシート","index":2,"n_rows":43,"n_cols":21,"rows_kept":43,"cut":false,"hidden":false,"merged":[[5,1,5,8],[0,1,0,8],[21,1,21,7],[22,1,22,7],[23,1,23,7],[1,1,1,8],[2,1,2,8],[6,2,6,4],[6,6,6,8],[7,2,7,4],[7,6,7,8],[24,1,24,7],[8,1,9,1],[8,2,9,4],[8,6,8,8],[9,6,9,8],[10,2,10,8],[20,1,20,7],[27,1,27,7],[28,1,28,7],[29,1,30,7],[32,1,33,8],[25,1,25,7],[26,1,26,7]]}
[null,"※群馬県高体連バスケットボール専門部・（一財）群馬県バスケットボール協会主催大会　入場時提出用",null,null,null,null,null,null,null,null,1]
[null,"健康チェックシート　兼　大会参加同意書",null,null,null,null,null,null,null,null,null,null,null,null,null,null,null,null,"最初の番号",{"$f":"MIN(入力シート!A3:A52)","v":1}]
[null,"　本健康チェックシートは、群馬県高体連バスケットボール専門部・（一財）群馬県バスケットボール協会が開催する各種大会において新型コロナウイルス感染症の拡大を防止するため、参加者の健康状態並びに参加同意を確認することを目的としています。\n本健康チェックシートに記入いただいた個人情報について、群馬県高体連バスケットボール専門部・（一財）群馬県バスケットボール協会は、厳正なる管理のもとに保管し、大会運営関係者の健康状態の把握、来場可否の判断および必要なご連絡のためにのみ利用します。また、個人情報保護法等の法令において認められる場合を除きご本人の同意を得ずに第三者に提供いたしません。但し、大会会場にて感染症患者またはその疑いのある方が発見された場合に必要な範囲で保健所等に提供することがあります。",null,null,null,null,null,null,null,null,null,null,null,null,null,null,null,null,"最後の番号",{"$f":"MAX(入力シート!A3:A52)","v":5},"←入力データ件数"]
[]
[null,"＜基本情報＞"]
[null,{"$f":"IF(VLOOKUP(K1,入力シート!$A$3:$M$52,3,0)=\"生徒\",\"【区分：☑生徒　□指導者　□大会関係者　□その他（　　　　　　　　）】\",IF(VLOOKUP(K1,入力シート!$A$3:$M$52,3,0)=\"指導者\",\"【区分：□生徒　☑指導者　□大会関係者　□その他（　　　　　　　　）】\",IF(VLOOKUP(K1,入力シート!$A$3:$M$52,3,0)=\"大会関係者\",\"【区分：□生徒　□指導者　☑大会関係者　□その他（　　　　　　　　）】\",\"【区分：□生徒　□指導者　□大会関係者　☑その他（　\"&VLOOKUP(K1,入力シート!$A$3:$M$52,4,0)&\"　）】\")))","v":"【区分：□生徒　☑指導者　□大会関係者　□その他（　　　　　　　　）】"}]
[null,"所属\n（学校名・会社名等）",{"$f":"VLOOKUP(K1,入力シート!$A$3:$M$52,2,0)","v":"群馬県立群馬高等学校"},null,null,"代表者\n連絡先",{"$f":"VLOOKUP(1,入力シート!$A$3:$AC$52,12,0)","v":"070-7212-7897 "}]
[null,"フリガナ",{"$f":"VLOOKUP(K1,入力シート!$A$3:$M$52,6,0)","v":"タケウチ ヤスノブ"},null,null,"生年月日",{"$f":"VLOOKUP(K1,入力シート!$A$3:$M$52,9,0)","v":"1980-04-19"}]
[null,"氏名",{"$f":"VLOOKUP(K1,入力シート!$A$3:$M$52,5,0)","v":"竹内 康伸"},null,null,"電話番号",{"$f":"VLOOKUP(K1,入力シート!$A$3:$M$52,12,0)","v":"070-7212-7897 "}]
[null,null,{"$f":"VLOOKUP(A3,入力シート!$A$3:$M$52,4,0)","v":{"$error":"#N/A"}},null,null,"Eメール\nアドレス"]
[null,"住所",{"$f":"\"〒\"&VLOOKUP(K1,入力シート!$A$3:$M$52,7,0)&CHAR(10)&VLOOKUP(K1,入力シート!$A$3:$M$52,8,0)","v":"〒436-0114\n静岡県掛川市高田9-11-5"}]
[]
[null,"＜試合当日までの体温＞"]
[null,"日付","起床時体温","日付","起床時体温","日付","起床時体温","日付","起床時体温"]
[null,{"$f":"D15-4","v":"2021-05-14"},{"$f":"IF(INDEX(入力シート!$N$3:$AC$52,MATCH($K$1,入力シート!$A$3:$A$52,0),MATCH(B15,入力シート!$N$1:$AC$1,0))=0,\"℃\",INDEX(入力シート!$N$3:$AC$52,MATCH($K$1,入力シート!$A$3:$A$52,0),MATCH(B15,入力シート!$N$1:$AC$1,0)))","v":"℃"},{"$f":"F15-4","v":"2021-05-18"},{"$f":"IF(INDEX(入力シート!$N$3:$AC$52,MATCH($K$1,入力シート!$A$3:$A$52,0),MATCH(D15,入力シート!$N$1:$AC$1,0))=0,\"℃\",INDEX(入力シート!$N$3:$AC$52,MATCH($K$1,入力シート!$A$3:$A$52,0),MATCH(D15,入力シート!$N$1:$AC$1,0)))","v":"℃"},{"$f":"H15-4","v":"2021-05-22"},{"$f":"IF(INDEX(入力シート!$N$3:$AC$52,MATCH($K$1,入力シート!$A$3:$A$52,0),MATCH(F15,入力シート!$N$1:$AC$1,0))=0,\"℃\",INDEX(入力シート!$N$3:$AC$52,MATCH($K$1,入力シート!$A$3:$A$52,0),MATCH(F15,入力シート!$N$1:$AC$1,0)))","v":"℃"},{"$f":"H18-3","v":"2021-05-26"},{"$f":"IF(INDEX(入力シート!$N$3:$AC$52,MATCH($K$1,入力シート!$A$3:$A$52,0),MATCH(H15,入力シート!$N$1:$AC$1,0))=0,\"℃\",INDEX(入力シート!$N$3:$AC$52,MATCH($K$1,入力シート!$A$3:$A$52,0),MATCH(H15,入力シート!$N$1:$AC$1,0)))","v":"℃"}]
{"$rows_left_out":29}
{"sheet":"チェックシート (連日用)","index":3,"n_rows":43,"n_cols":21,"rows_kept":43,"cut":false,"hidden":false,"merged":[[0,1,0,8],[1,1,1,8],[2,1,2,8],[5,1,5,8],[6,2,6,4],[6,6,6,8],[7,2,7,4],[7,6,7,8],[8,1,9,1],[8,2,9,4],[8,6,8,8],[9,6,9,8],[32,1,33,8],[10,2,10,8],[20,1,20,7],[21,1,21,7],[22,1,22,7],[23,1,23,7],[24,1,24,7],[25,1,25,7],[26,1,26,7],[27,1,27,7],[28,1,28,7],[29,1,30,7]]}
[null,"※群馬県高体連バスケットボール専門部・（一財）群馬県バスケットボール協会主催大会　入場時提出用",null,null,null,null,null,null,null,null,3]
[null,"健康チェックシート　兼　大会参加同意書",null,null,null,null,null,null,null,null,null,null,null,null,null,null,null,null,"最初の番号",{"$f":"MIN(入力シート!A3:A52)","v":1}]
[null,"　本健康チェックシートは、群馬県高体連バスケットボール専門部・（一財）群馬県バスケットボール協会が開催する各種大会において新型コロナウイルス感染症の拡大を防止するため、参加者の健康状態並びに参加同意を確認することを目的としています。\n本健康チェックシートに記入いただいた個人情報について、群馬県高体連バスケットボール専門部・（一財）群馬県バスケットボール協会は、厳正なる管理のもとに保管し、大会運営関係者の健康状態の把握、来場可否の判断および必要なご連絡のためにのみ利用します。また、個人情報保護法等の法令において認められる場合を除きご本人の同意を得ずに第三者に提供いたしません。但し、大会会場にて感染症患者またはその疑いのある方が発見された場合に必要な範囲で保健所等に提供することがあります。",null,null,null,null,null,null,null,null,null,null,null,null,null,null,null,null,"最後の番号",{"$f":"MAX(入力シート!A3:A52)","v":5},"←入力データ件数"]
[]
[null,"＜基本情報＞"]
[null,{"$f":"IF(VLOOKUP(K1,入力シート!$A$3:$M$52,3,0)=\"生徒\",\"【区分：☑生徒　□指導者　□大会関係者　□その他（　　　　　　　　）】\",IF(VLOOKUP(K1,入力シート!$A$3:$M$52,3,0)=\"指導者\",\"【区分：□生徒　☑指導者　□大会関係者　□その他（　　　　　　　　）】\",IF(VLOOKUP(K1,入力シート!$A$3:$M$52,3,0)=\"大会関係者\",\"【区分：□生徒　□指導者　☑大会関係者　□その他（　　　　　　　　）】\",\"【区分：□生徒　□指導者　□大会関係者　☑その他（　\"&VLOOKUP(K1,入力シート!$A$3:$M$52,4,0)&\"　）】\")))","v":"【区分：□生徒　□指導者　□大会関係者　☑その他（　帯同審判　）】"}]
[null,"所属\n（学校名・会社名等）",{"$f":"VLOOKUP(K1,入力シート!$A$3:$M$52,2,0)","v":"群馬県立群馬高等学校"},null,null,"代表者\n連絡先",{"$f":"VLOOKUP(1,入力シート!$A$3:$AC$52,12,0)","v":"070-7212-7897 "}]
[null,"フリガナ",{"$f":"VLOOKUP(K1,入力シート!$A$3:$M$52,6,0)","v":"アンドウ ミキヤ"},null,null,"生年月日",{"$f":"VLOOKUP(K1,入力シート!$A$3:$M$52,9,0)","v":"1995-05-13"}]
[null,"氏名",{"$f":"VLOOKUP(K1,入力シート!$A$3:$M$52,5,0)","v":"安藤 幹也"},null,null,"電話番号",{"$f":"VLOOKUP(K1,入力シート!$A$3:$M$52,12,0)","v":"090-7857-1505 "}]
[null,null,{"$f":"VLOOKUP(A3,入力シート!$A$3:$M$52,4,0)","v":{"$error":"#N/A"}},null,null,"Eメール\nアドレス"]
[null,"住所",{"$f":"\"〒\"&VLOOKUP(K1,入力シート!$A$3:$M$52,7,0)&CHAR(10)&VLOOKUP(K1,入力シート!$A$3:$M$52,8,0)","v":"〒982-0843\n宮城県仙台市太白区茂ヶ崎3-10-6"}]
[]
[null,"＜試合当日までの体温＞"]
[null,"日付","起床時体温","日付","起床時体温","日付","起床時体温","日付","起床時体温"]
[]
{"$rows_left_out":29}
{"sheet":"団体用P1","index":4,"n_rows":38,"n_cols":17,"rows_kept":38,"cut":false,"hidden":false,"merged":[[35,1,35,10],[36,1,36,10],[37,1,37,10],[30,1,30,2],[30,3,30,10],[31,1,31,10],[32,1,32,10],[33,1,33,10],[34,1,34,10],[0,1,0,2],[1,1,2,4],[1,5,1,10],[2,5,2,10],[3,1,3,4],[3,5,3,10],[0,7,0,8]]}
[null,"様式２（団体用）",null,null,null,null,"利用日","令和３年６月",null,26]
[null,"健康状態申告書 ",null,null,null,"利　用　施　設　及　び　時　間",null,null,null,null,null,null,null,null,null,null,"日付(J1セル)を更新して印刷できます。"]
[null,null,null,null,null,"施設名　ALSOKぐんまアリーナ　　      時間　　9時　～17時　"]
[null,{"$f":"\"　団体名　\"&入力シート!B3","v":"　団体名　群馬県立群馬高等学校"},null,null,null,"　大会名　第７５回関東高等学校女子バスケットボール選手権大会"]
[null,"番号","①氏名・年齢 ","②\n性別 ","③住 所 \n（群馬県在住は市町村から。\n他都道府県の方は都道府県から）","④発熱、咳、全 身倦怠感等の感冒様症状","⑤頭痛、\n下痢、\n結膜炎、\n嗅覚 味覚障害","⑥感染の流行地域への14日以内の訪問歴 ","⑦新型ｺﾛﾅｳｲﾙｽ感染症陽性とされた者との濃厚接触","⑧同居家族や身近な知人に感染が疑われる者がいるか","⑨緊急時連絡先 \n（携帯電話番号） \n携帯のないお子さんの場合は保護者の番号"]
[{"$f":"IF(入力シート!A3=\"\",\"\",入力シート!A3)","v":1},"責任者\n①",{"$f":"IF(A6=\"\",\"\",VLOOKUP(A6,入力シート!$A$3:$K$52,5,0)&CHAR(10)&\"                         （　\"&VLOOKUP(A6,入力シート!$A$3:$K$52,10,0)&\"　才）\")","v":"竹内 康伸\n                         （　41　才）"},{"$f":"IF(A6=\"\",\"\",VLOOKUP(A6,入力シート!$A$3:$M$52,11,0))","v":"男性"},{"$f":"IF(A6=\"\",\"\",VLOOKUP(A6,入力シート!$A$3:$M$52,8,0))","v":"静岡県掛川市高田9-11-5"},"あり・なし ","あり・なし ","あり・なし ","あり・なし ","あり・なし ",{"$f":"IF(A6=\"\",\"\",VLOOKUP(A6,入力シート!$A$3:$M$52,12,0))","v":"070-7212-7897 "}]
[{"$f":"IF(入力シート!A4=\"\",\"\",入力シート!A4)","v":2},"②",{"$f":"IF(A7=\"\",\"\",VLOOKUP(A7,入力シート!$A$3:$K$52,5,0)&CHAR(10)&\"                         （　\"&VLOOKUP(A7,入力シート!$A$3:$K$52,10,0)&\"　才）\")","v":"伊藤 茂信\n                         （　28　才）"},{"$f":"IF(A7=\"\",\"\",VLOOKUP(A7,入力シート!$A$3:$M$52,11,0))","v":"男性"},{"$f":"IF(A7=\"\",\"\",VLOOKUP(A7,入力シート!$A$3:$M$52,8,0))","v":"福島県田村市常葉町山根8-9-3"},"あり・なし ","あり・なし ","あり・なし ","あり・なし ","あり・なし ",{"$f":"IF(A7=\"\",\"\",VLOOKUP(A7,入力シート!$A$3:$M$52,12,0))","v":"070-1697-4346 "}]
[{"$f":"IF(入力シート!A5=\"\",\"\",入力シート!A5)","v":3},"③",{"$f":"IF(A8=\"\",\"\",VLOOKUP(A8,入力シート!$A$3:$K$52,5,0)&CHAR(10)&\"                         （　\"&VLOOKUP(A8,入力シート!$A$3:$K$52,10,0)&\"　才）\")","v":"安藤 幹也\n                         （　26　才）"},{"$f":"IF(A8=\"\",\"\",VLOOKUP(A8,入力シート!$A$3:$M$52,11,0))","v":"男性"},{"$f":"IF(A8=\"\",\"\",VLOOKUP(A8,入力シート!$A$3:$M$52,8,0))","v":"宮城県仙台市太白区茂ヶ崎3-10-6"},"あり・なし ","あり・なし ","あり・なし ","あり・なし ","あり・なし ",{"$f":"IF(A8=\"\",\"\",VLOOKUP(A8,入力シート!$A$3:$M$52,12,0))","v":"090-7857-1505 "}]
[{"$f":"IF(入力シート!A6=\"\",\"\",入力シート!A6)","v":4},"④",{"$f":"IF(A9=\"\",\"\",VLOOKUP(A9,入力シート!$A$3:$K$52,5,0)&CHAR(10)&\"                         （　\"&VLOOKUP(A9,入力シート!$A$3:$K$52,10,0)&\"　才）\")","v":"白石 次男\n                         （　39　才）"},{"$f":"IF(A9=\"\",\"\",VLOOKUP(A9,入力シート!$A$3:$M$52,11,0))","v":"男性"},{"$f":"IF(A9=\"\",\"\",VLOOKUP(A9,入力シート!$A$3:$M$52,8,0))","v":"東京都文京区小石川5-1-1"},"あり・なし ","あり・なし ","あり・なし ","あり・なし ","あり・なし ",{"$f":"IF(A9=\"\",\"\",VLOOKUP(A9,入力シート!$A$3:$M$52,12,0))","v":"090-5237-3080 "}]
[{"$f":"IF(入力シート!A7=\"\",\"\",入力シート!A7)","v":5},"⑤",{"$f":"IF(A10=\"\",\"\",VLOOKUP(A10,入力シート!$A$3:$K$52,5,0)&CHAR(10)&\"                         （　\"&VLOOKUP(A10,入力シート!$A$3:$K$52,10,0)&\"　才）\")","v":"金城 荘介\n                         （　18　才）"},{"$f":"IF(A10=\"\",\"\",VLOOKUP(A10,入力シート!$A$3:$M$52,11,0))","v":"男性"},{"$f":"IF(A10=\"\",\"\",VLOOKUP(A10,入力シート!$A$3:$M$52,8,0))","v":"栃木県宇都宮市八千代4177"},"あり・なし ","あり・なし ","あり・なし ","あり・なし ","あり・なし ",{"$f":"IF(A10=\"\",\"\",VLOOKUP(A10,入力シート!$A$3:$M$52,12,0))","v":"090-3233-6517 "}]
[{"$f":"IF(入力シート!A8=\"\",\"\",入力シート!A8)","v":""},"⑥",{"$f":"IF(A11=\"\",\"\",VLOOKUP(A11,入力シート!$A$3:$K$52,5,0)&CHAR(10)&\"                         （　\"&VLOOKUP(A11,入力シート!$A$3:$K$52,10,0)&\"　才）\")","v":""},{"$f":"IF(A11=\"\",\"\",VLOOKUP(A11,入力シート!$A$3:$M$52,11,0))","v":""},{"$f":"IF(A11=\"\",\"\",VLOOKUP(A11,入力シート!$A$3:$M$52,8,0))","v":""},"あり・なし ","あり・なし ","あり・なし ","あり・なし ","あり・なし ",{"$f":"IF(A11=\"\",\"\",VLOOKUP(A11,入力シート!$A$3:$M$52,12,0))","v":""}]
[{"$f":"IF(入力シート!A9=\"\",\"\",入力シート!A9)","v":""},"⑦",{"$f":"IF(A12=\"\",\"\",VLOOKUP(A12,入力シート!$A$3:$K$52,5,0)&CHAR(10)&\"                         （　\"&VLOOKUP(A12,入力シート!$A$3:$K$52,10,0)&\"　才）\")","v":""},{"$f":"IF(A12=\"\",\"\",VLOOKUP(A12,入力シート!$A$3:$M$52,11,0))","v":""},{"$f":"IF(A12=\"\",\"\",VLOOKUP(A12,入力シート!$A$3:$M$52,8,0))","v":""},"あり・なし ","あり・なし ","あり・なし ","あり・なし ","あり・なし ",{"$f":"IF(A12=\"\",\"\",VLOOKUP(A12,入力シート!$A$3:$M$52,12,0))","v":""}]
[{"$f":"IF(入力シート!A10=\"\",\"\",入力シート!A10)","v":""},"⑧",{"$f":"IF(A13=\"\",\"\",VLOOKUP(A13,入力シート!$A$3:$K$52,5,0)&CHAR(10)&\"                         （　\"&VLOOKUP(A13,入力シート!$A$3:$K$52,10,0)&\"　才）\")","v":""},{"$f":"IF(A13=\"\",\"\",VLOOKUP(A13,入力シート!$A$3:$M$52,11,0))","v":""},{"$f":"IF(A13=\"\",\"\",VLOOKUP(A13,入力シート!$A$3:$M$52,8,0))","v":""},"あり・なし ","あり・なし ","あり・なし ","あり・なし ","あり・なし ",{"$f":"IF(A13=\"\",\"\",VLOOKUP(A13,入力シート!$A$3:$M$52,12,0))","v":""}]
[{"$f":"IF(入力シート!A11=\"\",\"\",入力シート!A11)","v":""},"⑨",{"$f":"IF(A14=\"\",\"\",VLOOKUP(A14,入力シート!$A$3:$K$52,5,0)&CHAR(10)&\"                         （　\"&VLOOKUP(A14,入力シート!$A$3:$K$52,10,0)&\"　才）\")","v":""},{"$f":"IF(A14=\"\",\"\",VLOOKUP(A14,入力シート!$A$3:$M$52,11,0))","v":""},{"$f":"IF(A14=\"\",\"\",VLOOKUP(A14,入力シート!$A$3:$M$52,8,0))","v":""},"あり・なし ","あり・なし ","あり・なし ","あり・なし ","あり・なし ",{"$f":"IF(A14=\"\",\"\",VLOOKUP(A14,入力シート!$A$3:$M$52,12,0))","v":""}]
[{"$f":"IF(入力シート!A12=\"\",\"\",入力シート!A12)","v":""},"⑩",{"$f":"IF(A15=\"\",\"\",VLOOKUP(A15,入力シート!$A$3:$K$52,5,0)&CHAR(10)&\"                         （　\"&VLOOKUP(A15,入力シート!$A$3:$K$52,10,0)&\"　才）\")","v":""},{"$f":"IF(A15=\"\",\"\",VLOOKUP(A15,入力シート!$A$3:$M$52,11,0))","v":""},{"$f":"IF(A15=\"\",\"\",VLOOKUP(A15,入力シート!$A$3:$M$52,8,0))","v":""},"あり・なし ","あり・なし ","あり・なし ","あり・なし ","あり・なし ",{"$f":"IF(A15=\"\",\"\",VLOOKUP(A15,入力シート!$A$3:$M$52,12,0))","v":""}]
{"$rows_left_out":24}
{"sheet":"団体用P2","index":5,"n_rows":38,"n_cols":17,"rows_kept":38,"cut":false,"hidden":false,"merged":[[35,1,35,10],[36,1,36,10],[37,1,37,10],[30,1,30,2],[30,3,30,10],[31,1,31,10],[32,1,32,10],[33,1,33,10],[34,1,34,10],[0,1,0,2],[1,1,2,4],[1,5,1,10],[2,5,2,10],[3,1,3,4],[3,5,3,10],[0,7,0,8]]}
[null,"様式２（団体用）",null,null,null,null,"利用日","令和３年６月",null,26]
[null,"健康状態申告書 ",null,null,null,"利　用　施　設　及　び　時　間",null,null,null,null,null,null,null,null,null,null,"日付(J1セル)を更新して印刷できます。"]
[null,null,null,null,null,"施設名　ALSOKぐんまアリーナ　　      時間　　9時　～17時　"]
[null,{"$f":"\"　団体名　\"&入力シート!B3","v":"　団体名　群馬県立群馬高等学校"},null,null,null,"　大会名　第７５回関東高等学校女子バスケットボール選手権大会"]
[null,"番号","①氏名・年齢 ","②\n性別 ","③住 所 \n（群馬県在住は市町村から。\n他都道府県の方は都道府県から）","④発熱、咳、全 身倦怠感等の感冒様症状","⑤頭痛、\n下痢、\n結膜炎、\n嗅覚 味覚障害","⑥感染の流行地域への14日以内の訪問歴 ","⑦新型ｺﾛﾅｳｲﾙｽ感染症陽性とされた者との濃厚接触","⑧同居家族や身近な知人に感染が疑われる者がいるか","⑨緊急時連絡先 \n（携帯電話番号） \n携帯のないお子さんの場合は保護者の番号"]
[{"$f":"IF(入力シート!A28=\"\",\"\",入力シート!A28)","v":""},"㉖",{"$f":"IF(A6=\"\",\"\",VLOOKUP(A6,入力シート!$A$3:$K$52,5,0)&CHAR(10)&\"                         （　\"&VLOOKUP(A6,入力シート!$A$3:$K$52,10,0)&\"　才）\")","v":""},{"$f":"IF(A6=\"\",\"\",VLOOKUP(A6,入力シート!$A$3:$M$52,11,0))","v":""},{"$f":"IF(A6=\"\",\"\",VLOOKUP(A6,入力シート!$A$3:$M$52,8,0))","v":""},"あり・なし ","あり・なし ","あり・なし ","あり・なし ","あり・なし ",{"$f":"IF(A6=\"\",\"\",VLOOKUP(A6,入力シート!$A$3:$M$52,12,0))","v":""}]
[{"$f":"IF(入力シート!A29=\"\",\"\",入力シート!A29)","v":""},"㉗",{"$f":"IF(A7=\"\",\"\",VLOOKUP(A7,入力シート!$A$3:$K$52,5,0)&CHAR(10)&\"                         （　\"&VLOOKUP(A7,入力シート!$A$3:$K$52,10,0)&\"　才）\")","v":""},{"$f":"IF(A7=\"\",\"\",VLOOKUP(A7,入力シート!$A$3:$M$52,11,0))","v":""},{"$f":"IF(A7=\"\",\"\",VLOOKUP(A7,入力シート!$A$3:$M$52,8,0))","v":""},"あり・なし ","あり・なし ","あり・なし ","あり・なし ","あり・なし ",{"$f":"IF(A7=\"\",\"\",VLOOKUP(A7,入力シート!$A$3:$M$52,12,0))","v":""}]
[{"$f":"IF(入力シート!A30=\"\",\"\",入力シート!A30)","v":""},"㉘",{"$f":"IF(A8=\"\",\"\",VLOOKUP(A8,入力シート!$A$3:$K$52,5,0)&CHAR(10)&\"                         （　\"&VLOOKUP(A8,入力シート!$A$3:$K$52,10,0)&\"　才）\")","v":""},{"$f":"IF(A8=\"\",\"\",VLOOKUP(A8,入力シート!$A$3:$M$52,11,0))","v":""},{"$f":"IF(A8=\"\",\"\",VLOOKUP(A8,入力シート!$A$3:$M$52,8,0))","v":""},"あり・なし ","あり・なし ","あり・なし ","あり・なし ","あり・なし ",{"$f":"IF(A8=\"\",\"\",VLOOKUP(A8,入力シート!$A$3:$M$52,12,0))","v":""}]
[{"$f":"IF(入力シート!A31=\"\",\"\",入力シート!A31)","v":""},"㉙",{"$f":"IF(A9=\"\",\"\",VLOOKUP(A9,入力シート!$A$3:$K$52,5,0)&CHAR(10)&\"                         （　\"&VLOOKUP(A9,入力シート!$A$3:$K$52,10,0)&\"　才）\")","v":""},{"$f":"IF(A9=\"\",\"\",VLOOKUP(A9,入力シート!$A$3:$M$52,11,0))","v":""},{"$f":"IF(A9=\"\",\"\",VLOOKUP(A9,入力シート!$A$3:$M$52,8,0))","v":""},"あり・なし ","あり・なし ","あり・なし ","あり・なし ","あり・なし ",{"$f":"IF(A9=\"\",\"\",VLOOKUP(A9,入力シート!$A$3:$M$52,12,0))","v":""}]
[{"$f":"IF(入力シート!A32=\"\",\"\",入力シート!A32)","v":""},"㉚",{"$f":"IF(A10=\"\",\"\",VLOOKUP(A10,入力シート!$A$3:$K$52,5,0)&CHAR(10)&\"                         （　\"&VLOOKUP(A10,入力シート!$A$3:$K$52,10,0)&\"　才）\")","v":""},{"$f":"IF(A10=\"\",\"\",VLOOKUP(A10,入力シート!$A$3:$M$52,11,0))","v":""},{"$f":"IF(A10=\"\",\"\",VLOOKUP(A10,入力シート!$A$3:$M$52,8,0))","v":""},"あり・なし ","あり・なし ","あり・なし ","あり・なし ","あり・なし ",{"$f":"IF(A10=\"\",\"\",VLOOKUP(A10,入力シート!$A$3:$M$52,12,0))","v":""}]
[{"$f":"IF(入力シート!A33=\"\",\"\",入力シート!A33)","v":""},"㉛",{"$f":"IF(A11=\"\",\"\",VLOOKUP(A11,入力シート!$A$3:$K$52,5,0)&CHAR(10)&\"                         （　\"&VLOOKUP(A11,入力シート!$A$3:$K$52,10,0)&\"　才）\")","v":""},{"$f":"IF(A11=\"\",\"\",VLOOKUP(A11,入力シート!$A$3:$M$52,11,0))","v":""},{"$f":"IF(A11=\"\",\"\",VLOOKUP(A11,入力シート!$A$3:$M$52,8,0))","v":""},"あり・なし ","あり・なし ","あり・なし ","あり・なし ","あり・なし ",{"$f":"IF(A11=\"\",\"\",VLOOKUP(A11,入力シート!$A$3:$M$52,12,0))","v":""}]
[{"$f":"IF(入力シート!A34=\"\",\"\",入力シート!A34)","v":""},"㉜",{"$f":"IF(A12=\"\",\"\",VLOOKUP(A12,入力シート!$A$3:$K$52,5,0)&CHAR(10)&\"                         （　\"&VLOOKUP(A12,入力シート!$A$3:$K$52,10,0)&\"　才）\")","v":""},{"$f":"IF(A12=\"\",\"\",VLOOKUP(A12,入力シート!$A$3:$M$52,11,0))","v":""},{"$f":"IF(A12=\"\",\"\",VLOOKUP(A12,入力シート!$A$3:$M$52,8,0))","v":""},"あり・なし ","あり・なし ","あり・なし ","あり・なし ","あり・なし ",{"$f":"IF(A12=\"\",\"\",VLOOKUP(A12,入力シート!$A$3:$M$52,12,0))","v":""}]
[{"$f":"IF(入力シート!A35=\"\",\"\",入力シート!A35)","v":""},"㉝",{"$f":"IF(A13=\"\",\"\",VLOOKUP(A13,入力シート!$A$3:$K$52,5,0)&CHAR(10)&\"                         （　\"&VLOOKUP(A13,入力シート!$A$3:$K$52,10,0)&\"　才）\")","v":""},{"$f":"IF(A13=\"\",\"\",VLOOKUP(A13,入力シート!$A$3:$M$52,11,0))","v":""},{"$f":"IF(A13=\"\",\"\",VLOOKUP(A13,入力シート!$A$3:$M$52,8,0))","v":""},"あり・なし ","あり・なし ","あり・なし ","あり・なし ","あり・なし ",{"$f":"IF(A13=\"\",\"\",VLOOKUP(A13,入力シート!$A$3:$M$52,12,0))","v":""}]
[{"$f":"IF(入力シート!A36=\"\",\"\",入力シート!A36)","v":""},"㉞",{"$f":"IF(A14=\"\",\"\",VLOOKUP(A14,入力シート!$A$3:$K$52,5,0)&CHAR(10)&\"                         （　\"&VLOOKUP(A14,入力シート!$A$3:$K$52,10,0)&\"　才）\")","v":""},{"$f":"IF(A14=\"\",\"\",VLOOKUP(A14,入力シート!$A$3:$M$52,11,0))","v":""},{"$f":"IF(A14=\"\",\"\",VLOOKUP(A14,入力シート!$A$3:$M$52,8,0))","v":""},"あり・なし ","あり・なし ","あり・なし ","あり・なし ","あり・なし ",{"$f":"IF(A14=\"\",\"\",VLOOKUP(A14,入力シート!$A$3:$M$52,12,0))","v":""}]
[{"$f":"IF(入力シート!A37=\"\",\"\",入力シート!A37)","v":""},"㉟",{"$f":"IF(A15=\"\",\"\",VLOOKUP(A15,入力シート!$A$3:$K$52,5,0)&CHAR(10)&\"                         （　\"&VLOOKUP(A15,入力シート!$A$3:$K$52,10,0)&\"　才）\")","v":""},{"$f":"IF(A15=\"\",\"\",VLOOKUP(A15,入力シート!$A$3:$M$52,11,0))","v":""},{"$f":"IF(A15=\"\",\"\",VLOOKUP(A15,入力シート!$A$3:$M$52,8,0))","v":""},"あり・なし ","あり・なし ","あり・なし ","あり・なし ","あり・なし ",{"$f":"IF(A15=\"\",\"\",VLOOKUP(A15,入力シート!$A$3:$M$52,12,0))","v":""}]
{"$rows_left_out":23}